BDBM50242348 CHEMBL460025::pentadecanoic acid
SMILES CCCCCCCCCCCCCCC(O)=O
InChI Key InChIKey=WQEPLUUGTLDZJY-UHFFFAOYSA-N
Data  2 IC50
PDB links: 6 PDB IDs match this monomer.
  Tab Delimited (TSV)   2D SDfile   Computed 3D by Vconf -m prep SDfile
Find this compound or compounds like it in BindingDB:
Activity Spreadsheet -- Enzyme Inhibition Constant Data from BindingDB
Found 1 hit for monomerid = 50242348
TargetProstaglandin G/H synthase 1(Bos taurus)
Uppsala University
Curated by ChEMBL
LigandPNGBDBM50242348(CHEMBL460025 | pentadecanoic acid)
Affinity DataIC50: >5.00E+5nM. Assay description: Inhibition of bovine COX1-mediated prostaglandin biosynthesis using [1-14C]arachidonic acid
In DepthDetails ArticlePubMed